使用nose_parameterized使unitTest实现参数化

nose-parameterized是一个针对Python单元测试框架实现参数化的扩展

import unittest
# from nose_parameterized import parameterized
from parameterized import parameterized

class TestAdd(unittest.TestCase):

    @parameterized.expand([
        ("01",1,2,3),
        ("02",2,2,4),
        ("03",4,4,4),
    ])
    def test(self, name, a, b, c):
        self.assertEqual(a+b,c)

if __name__ == '__main__':
    unittest.main(verbosity=2) 
"""
这里的verbosity是一个选项,表示测试结果的信息复杂度,有三个值
0 (静默模式): 你只能获得总的测试用例数和总的结果 比如 总共100个 失败20 成功80
1 (默认模式): 非常类似静默模式 只是在每个成功的用例前面有个“.” 每个失败的用例前面有个 “F”
2 (详细模式):测试结果会显示每个测试用例的所有相关的信息
并且 你在命令行里加入不同的参数可以起到一样的效果
加入 --quiet 参数 等效于 verbosity=0
加入--verbose参数等效于 verbosity=2
什么都不加就是 verbosity=1
"""

或者:

#nose_parameterized_demo
import unittest 
from nose_parameterized import parameterized

class TestMathUnitTest(unittest.TestCase):
    
    params = [
     ("01",1,2,3),
        ("02",2,2,4),
        ("03",4,4,4),
 ] @parameterized.expand(input=params) 

def test(self, name, a, b, c):
        self.assertEqual(a+b,c)

 

运行结果

test_0_01 (__main__.TestAdd) ... ok
test_1_02 (__main__.TestAdd) ... ok
test_2_03 (__main__.TestAdd) ... FAIL

======================================================================
FAIL: test_2_03 (__main__.TestAdd)
----------------------------------------------------------------------
Traceback (most recent call last):
  File "E:\python3\lib\site-packages\parameterized\parameterized.py", line 392, in standalone_func
    return func(*(a + p.args), **p.kwargs)
  File "F:/python/test/canshuhua.py", line 15, in test
    self.assertEqual(a+b,c)
AssertionError: 8 != 4

----------------------------------------------------------------------
Ran 3 tests in 0.001s

FAILED (failures=1)

当相同入参和断言结果的用例越多,这种写法用起来越爽!

说明:


posted @ 2017-07-23 22:09  RoyFans  阅读(...)  评论(... 编辑 收藏